{"text_format":"1","workbook":"xlsx","n_sheets":5,"sheets":["Introduction","Inputs","Detailed Inputs","BTM System Purchase","BTM PPA"],"not_rendered":{"charts":7,"images":1,"macros":1,"external_links":0,"defined_names":48,"comments":2,"pivot_tables":0},"unopened":[],"bounds":{"document_bytes":16777216,"sheet_cells":100000,"rows_first":2000,"rows_last":500,"rows_between":2000,"halvings":0,"cell_chars":16384,"cell_head_chars":4096},"cells_cut":0,"cells_raw":0,"read":"whole","date_system":"1900"}

{"sheet":"Introduction","index":0,"n_rows":60,"n_cols":4,"rows_kept":60,"cut":false,"hidden":false,"merged":[[0,0,0,15]]}
[]
[]
[null,null,null,"Solar Pro Forma"]
[null,null,null,"v1.1 March 2021"]
[]
[]
[]
[]
[]
[]
[]
[]
[]
[]
[]
[]
[]
[]
[]
[]
[]
[]
[]
[]
[]
[]
[]
[]
[]
[]
[]
[]
[]
[]
[]
[]
[]
[]
[]
[]
{"$rows_left_out":21}
{"sheet":"Inputs","index":1,"n_rows":27,"n_cols":9,"rows_kept":27,"cut":false,"hidden":false,"merged":[[14,1,14,2],[7,1,7,2],[2,1,2,2],[3,1,3,2],[4,1,4,2],[5,1,5,2],[6,1,6,2],[8,1,8,2],[9,1,9,2],[11,1,11,2],[12,1,12,2],[13,1,13,2]]}
[]
[null,"User Inputs",null,null,null,null,"Financial Summary for Behind The Meter Installations"]
[null,"System Size",null,"kW DC",6,null,null,"System Purchase","PPA"]
[null,"City ",null,"Enter City or Town","Chicago",null,"System Size in kW",{"$f":"systemsize","v":6},{"$f":"systemsize","v":6}]
[null,"State",null,"Enter State","IL",null,"# Panels",{"$f":"'Detailed Inputs'!D9","v":15},{"$f":"'Detailed Inputs'!D9","v":15}]
[null,"Cost Per Installed Watt",null,"$/Installed Watt",{"$f":"INDEX('Detailed Inputs'!F79:H84,MATCH('Detailed Inputs'!F75,'Detailed Inputs'!H67:H72,0),MATCH(Inputs!E8,'Detailed Inputs'!F78:H78,0))","v":2.83}]
[null,"Electricity rate",null,"Average retail electricity rate per kWh",0.105,null,"Energy Offset:",{"$f":"'BTM System Purchase'!C102/E9","v":0.91773942947387699},{"$f":"'BTM PPA'!C119/Inputs!E9","v":0.91773942947387699}]
[null,"Installation Type",null,"Roof, Ground, or Canopy?","Roof"]
[null,"Estimated Annual Electricity Usage",null,"Total kilowatt hours used annually onsite",8000]
[null,"Federal Investment Tax Credit",null,"For taxable entities only, otherwise \"No\"","Yes"]
[null,"Asset Depreciation (MACRS)",null,"For taxable entities only, otherwise \"No\"","Yes"]
[null,"REC availability",null,"Are RECs available for this system?","No"]
[null,"REC Value",null,"$$ per REC",0]
[null,"REC Contract Term",null,"# years RECs are eligible for purchase",0]
[null,"REC Payout Term",null,"# years the value of RECs are paid",0]
[null,"Incentive availbility",null,"Does this system qualify for incentives?","No",null,"First Year Savings",{"$f":"'BTM System Purchase'!F75","v":-10062.686879241943},{"$f":"'BTM PPA'!F35","v":154.18022415161136}]
[null,"Incentive #1",null,"$ per installed watt",0]
[null,"Incentive #2",null,"$ lump sum up front",0,null,"Average Annual Savings",{"$f":"'BTM System Purchase'!D14","v":536.78255292327628},{"$f":"'BTM PPA'!E15","v":184.67237731402699}]
[null,"Incentive #3",null,"[please select]",0]
[null,"Incentive #4",null,"[please select]",0,null,"25-Year Costs:",{"$f":"'BTM System Purchase'!D7","v":-20508.91934117147},{"$f":"'BTM PPA'!E8","v":-18467.237731402704}]
[null,null,null,null,null,null,"25-Year Revenues:",{"$f":"'BTM System Purchase'!D8","v":33928.483164253375},{"$f":"'BTM PPA'!E9","v":23084.047164253374}]
[null,null,null,null,null,null,"25-Year Net Benefits:",{"$f":"'BTM System Purchase'!D9","v":13419.563823081906},{"$f":"'BTM PPA'!E10","v":4616.8094328506704}]
[null,null,null,null,null,null,"25-Year Net Present Value (NPV):",{"$f":"'BTM System Purchase'!D10","v":6431.161398055021},{"$f":"'BTM PPA'!E11","v":18193.758311650588}]
[null,null,null,null,null,null,"Return on Investment (ROI) %:",{"$f":"'BTM System Purchase'!D11","v":0.6543281778939104},{"$f":"'BTM PPA'!E12","v":0.24999999999999969}]
[null,null,null,null,null,null,"Internal Rate of Return (IRR) %:",{"$f":"'BTM System Purchase'!D12","v":8.066004737235688E-2},{"$f":"'BTM PPA'!E13","v":"NA"}]
[null,null,null,null,null,null,"Upfront Costs",{"$f":"'BTM System Purchase'!D13","v":-17340},{"$f":"'BTM PPA'!E14","v":0}]
[null,null,null,null,null,null,"Payback Period: years",{"$f":"'BTM System Purchase'!D15","v":9.3269178146163902},{"$f":"'BTM PPA'!E16","v":0}]

{"sheet":"Detailed Inputs","index":2,"n_rows":84,"n_cols":13,"rows_kept":84,"cut":false,"hidden":false,"merged":[[52,9,52,10],[53,9,53,10],[54,9,54,10],[55,9,55,10],[46,9,46,10],[47,9,47,10],[48,9,48,10],[49,9,49,10],[50,9,50,10],[51,9,51,10]]}
[]
[null,"SYSTEM INPUTS",null,null,null,"RATE INPUTS"]
[null,"Module Size","Watts",400,null,"Customer Retail Rate","$ per kWh",{"$f":"Inputs!E7","v":0.105}]
[null,"Capacity Factor:","%",0.12,null,"Customer Net Metering/Bill Credit Rate","$ per kWh",{"$f":"CustomerRate1","v":0.105}]
[null,"System Losses (%):","%",14.1,null,"Estimated Production to Directly Offset Load","% of Load",1]
[null,"Inverter Efficiency (%):","%",96,null,"Estimated Production to Grid","% of Load",{"$f":"(1-PercentLoad1)","v":0}]
[null,"Annual Power Production"," (kWh per kW):",{"$f":"SUM(C59:C70)","v":202.22751871744799},null,"PPA Type (Flat Rate or % Savings)","% of Electricity Rate","% Tied To Customer Rate"]
[null,"Annual Derate (%):","%",5.0000000000000001E-3,null,"Rate-Tied Saving Percent PPA Rate","% Savings",0.2]
[null,"Number of Panels:","#",{"$f":"systemsize/('Detailed Inputs'!D3/1000)","v":15},null,"Fixed PPA Rate","$ per kWh",0]
[null,"Azimuth","Degrees",180,null,"Fixed PPA Rate % Savings","% of Electricity Rate",{"$f":"(H3-H9)/H3","v":1}]
[null,"Tilt","Degrees",10]
[null,"Array Type","Fixed - Open Rack",{"$f":"IF(array_type=\"Fixed - Open Rack\",0,IF(array_type=\"Fixed - Roof Mounted\",1,IF(array_type=\"1-Axis\",2,IF(array_type=\"1-Axis Backtracking\",3,IF(array_type=\"2-axis\",4)))))","v":0},null,"FINANCING INPUTS"]
[null,"Module Type","Standard",{"$f":"IF(module_type=\"Standard\",0,IF(module_type=\"Premium\",1,IF(module_type=\"Thin film\",2,0)))","v":0},null,"Construction Loan"]
[null,"DC/AC Ratio",null,1.2,null,"Loan amount","% of upfront costs",0]
[null,"Ground Cover Ratio",null,0.4,null,"Interest Rate","%",0]
[null,null,null,null,null,"Loan Term","Years",0]
[null,"FINANCIAL INPUTS",null,null,null,"Closing","%",0]
[null,"Annual Energy & Demand Cost Increase:",null,0.02,null,"Downpayment","%",0]
[null,"Annual Customer PPA Rate Increase:",null,0.02,null,"Operating Loan"]
[null,"Developer NPV Discount Rate:",null,0.03,null,"Loan amount","%",0]
[null,"Customer NPV Discount Rate:",null,0.06,null,"Interest Rate","%",0]
[null,null,null,null,null,"Loan Term","Years",0]
[null,"REC Detail"]
[null,"REC availability","Are RECs available for this system?",{"$f":"Inputs!E12","v":"No"},null,"Closing","%",0]
[null,"REC Value","$$ per REC",{"$f":"Inputs!E13","v":0},null,"Downpayment","%",0]
[null,"REC Contract Term","# years RECs are eligible for purchase",{"$f":"Inputs!E14","v":0}]
[null,"REC Payout Term","# years the value of RECs are paid",{"$f":"Inputs!E15","v":0},null,"ENERGY PRODUCTION"]
[null,"RECs Generated","# over entire contract term",{"$f":"SUMIF('BTM System Purchase'!F86:'BTM System Purchase'!AD86, \"<=\"&D26,'BTM System Purchase'!F102:'BTM System Purchase'!AD102)/1000","v":0},null,"PV Watts generated production or manual?",null,"PV Watts"]
[null,"Total REC Value","$ over entire contract term",{"$f":"IF(Inputs!E12=\"Yes\",D25*D28,0)","v":0}]
[null,null,null,null,null,"MANUAL PRODUCTION INPUTS","First Year Power Generation"]
[null,"Total Incentive Value",null,null,null,"Month"]
[null,"Incentive #1",{"$f":"Inputs!C17","v":0},{"$f":"IF(Inputs!D17=\"$ per installed watt\",(Inputs!E17*systemsize*1000),Inputs!E17)","v":0},null,"January",null,"<= Enter total kilowatt hours for each month of the first production year"]
[null,"Incentive #2",{"$f":"Inputs!C18","v":0},{"$f":"IF(Inputs!D18=\"$ per installed watt\",(Inputs!E18*systemsize*1000),Inputs!E18)","v":0},null,"February",null,"<="]
[null,"Incentive #3",{"$f":"Inputs!C19","v":0},{"$f":"IF(Inputs!D19=\"$ per installed watt\",(Inputs!E19*systemsize*1000),Inputs!E19)","v":0},null,"March",null,"<="]
[null,"Incentive #4",{"$f":"Inputs!C20","v":0},{"$f":"IF(Inputs!D20=\"$ per installed watt\",(Inputs!E20*systemsize*1000),Inputs!E20)","v":0},null,"April",null,"<="]
[null,null,null,null,null,"May",null,"<="]
[null,"Tax Incentives",null,null,null,"June",null,"<="]
[null,"Federal Investment Tax Credit","%",0.26,null,"July",null,"<="]
[null,"MACRS","%",0.35,null,"August",null,"<="]
[null,"Low Income Housing Tax Credit","Yes/No","No",null,"September",null,"<="]
{"$rows_left_out":45}
{"sheet":"BTM System Purchase","index":3,"n_rows":173,"n_cols":38,"rows_kept":173,"cut":false,"hidden":false,"merged":[[85,1,85,2],[19,1,19,2],[1,1,1,11]]}
[null,"Behind the Meter: System Purchase"]
[null,"The system is owned by the property owner, who is the utility customer. The system is installed onsite and behind the customer's meter. A portion of the energy produced by the system is used in real-time by the customer (Estimated Production to Directly Offset Load) and reduces the energy they buy from their electricity supplier. The remaining portion of energy prduced by the system is sent to the grid and sold to the utility at the qualifying net metering rate (Estimated Production to Grid). This portion is credited to the customers bill, typically at an agreed rate per kilowatt hour."]
[]
[null,"Summary Financial Metrics"]
[]
[null,"Key Performace Indicator"]
[null,"25-Year Costs:","$",{"$f":"AF31+AF37+AF41+AF48","v":-20508.91934117147}]
[null,"25-Year Revenues:","$",{"$f":"AF34+AF38+AF55+AF64+AF71","v":33928.483164253375}]
[null,"25-Year Net Benefits:","$",{"$f":"D7+D8","v":13419.563823081906}]
[null,"25-Year Net Present Value (NPV):","$",{"$f":"E74+NPV('Detailed Inputs'!D20,F74:AD74)","v":6431.161398055021}]
[null,"Return on Investment (ROI):","%",{"$f":"D9/(-D7)","v":0.6543281778939104}]
[null,"Internal Rate of Return (IRR)","$",{"$f":"IRR(E79:AD79)","v":8.066004737235688E-2}]
[null,"Upfront Costs","$",{"$f":"E31","v":-17340}]
[null,"Average Annual Revenue","$",{"$f":"AF74/25","v":536.78255292327628}]
[null,"Payback Period:","years",{"$f":"E76","v":9.3269178146163902}]
[]
[]
[null,"Business Case - System Owner"]
[]
[null,"Year",null,null,0,1,2,3,4,5,6,7,8,9,10,11,12,13,14,15,16,17,18,19,20,21,22,23,24,25]
[]
[null,"INSTALLATION COSTS"]
[null,"Generation Equipment","$",0.47581941847550441,{"$f":"-(systemsize*Costperwatt*1000)*'BTM System Purchase'!D23","v":-8079.4137257140646},null,null,null,null,null,null,null,null,null,null,null,null,null,null,null,null,null,null,null,null,null,null,null,null,null,null,{"$f":"SUM(E23:AE23)","v":-8079.4137257140646}]
[null,"Balance of Plant","$",0.23620447232666417,{"$f":"-(systemsize*Costperwatt*1000)*'BTM System Purchase'!D24","v":-4010.7519401067575},null,null,null,null,null,null,null,null,null,null,null,null,null,null,null,null,null,null,null,null,null,null,null,null,null,null,{"$f":"SUM(E24:AE24)","v":-4010.7519401067575}]
[null,"Interconnection","$",6.0103076242341374E-2,{"$f":"-(systemsize*Costperwatt*1000)*'BTM System Purchase'!D25","v":-1020.5502345949566},null,null,null,null,null,null,null,null,null,null,null,null,null,null,null,null,null,null,null,null,null,null,null,null,null,null,-1020.5502345949566]
[null,"Development Costs & Fee","$",0.22787303295549008,{"$f":"-(systemsize*Costperwatt*1000)*'BTM System Purchase'!D26","v":-3869.2840995842216},null,null,null,null,null,null,null,null,null,null,null,null,null,null,null,null,null,null,null,null,null,null,null,null,null,null,-3869.2840995842216]
[null,"Site Preparation cost","$/Installed watt",0.06,{"$f":"-(systemsize*1000)*D27","v":-360},null,null,null,null,null,null,null,null,null,null,null,null,null,null,null,null,null,null,null,null,null,null,null,null,null,null,-360]
[null,"Site Purchase Cost","$",0,{"$f":"D28","v":0},null,null,null,null,null,null,null,null,null,null,null,null,null,null,null,null,null,null,null,null,null,null,null,null,null,null,0]
[null,"Removal Cost","$",0,{"$f":"D29","v":0},null,null,null,null,null,null,null,null,null,null,null,null,null,null,null,null,null,null,null,null,null,null,null,null,null,null,0]
[null,"Site lease cost (based on per acre $=>)","$/Acre/Yr",0,{"$f":"-((systemsize*175)/43560)*D30","v":0},null,null,null,null,null,null,null,null,null,null,null,null,null,null,null,null,null,null,null,null,null,null,null,null,null,null,0]
[null,"Total Installation Costs",null,null,{"$f":"SUM(E23:E30)","v":-17340},null,null,null,null,null,null,null,null,null,null,null,null,null,null,null,null,null,null,null,null,null,null,null,null,null,null,-17340]
[]
[null,"CAPITAL COSTS"]
[null,"Construction loan","$",null,{"$f":"-E31*ConstructionLoanAmount","v":0},null,null,null,null,null,null,null,null,null,null,null,null,null,null,null,null,null,null,null,null,null,null,null,null,null,null,{"$f":"SUM(E34:AE34)","v":0}]
[null,"Construction loan downpayment","$",null,{"$f":"-E34*ConstructionDownpayment","v":0},null,null,null,null,null,null,null,null,null,null,null,null,null,null,null,null,null,null,null,null,null,null,null,null,null,null,0]
[null,"Construction loan closing costs","$",null,{"$f":"-E34*ConstructionClosing","v":0},null,null,null,null,null,null,null,null,null,null,null,null,null,null,null,null,null,null,null,null,null,null,null,null,null,null,0]
[null,"Construction loan payments","$",null,null,{"$f":"IF(F20=0,0,IF(F20<=ConstructionLoanTerm,-PMT(ConstructionLoanInterestRate/12,ConstructionLoanTerm*12,ConstructionLoanAmount*($E$31))*12,0))","v":0},0,0,0,0,0,0,0,0,0,0,0,0,0,0,0,0,0,0,0,0,0,0,0,0,null,0,null,null,null,null,"Installation",265000]
[null,"Operating loan","$",null,null,{"$f":"-E31*OpLoanAmount","v":0},null,null,null,null,null,null,null,null,null,null,null,null,null,null,null,null,null,null,null,null,null,null,null,null,null,0,null,"Installation",265000,null,"Capital Costs",52815.322352857802]
[null,"Operating loan downpayment","$",null,null,{"$f":"-OpDownpayment*F38","v":0},null,null,null,null,null,null,null,null,null,null,null,null,null,null,null,null,null,null,null,null,null,null,null,null,null,0,null,"Capital Costs",52815.322352857802,null,"O&M",267879.59796345502]
[null,"Operating loan closing costs","$",null,null,{"$f":"-OpClosing*F38","v":0},null,null,null,null,null,null,null,null,null,null,null,null,null,null,null,null,null,null,null,null,null,null,null,null,null,0,null,"O&M",267879.59796345502]
{"$rows_left_out":134}
{"sheet":"BTM PPA","index":4,"n_rows":254,"n_cols":34,"rows_kept":254,"cut":false,"hidden":false,"merged":[[1,1,1,10],[20,1,20,2],[40,1,40,2]]}
[null,"Behind the Meter: Power Purchase Areement"]
[null,"The system is built, owned, and maintained by a solar developer and installed behind the host's/customer's meter. The solar developer sells the energy produced by the system to the customer at an agreed rate. That rate can be a fixed cost per kilowatt hour purchased or it can be a guarantee of savings against their electricity rate. For example:\n• Fixed-Rate: The customer pays $0.10 per kilowatt hour for electricity from their supplier, and a Fixed-Rate of $0.08 per kWh from the solar developer.    The customer saves 20% initially. But, as the cost of electricity increases from their supplier over time, their savings grows.\n• Rate-Tied Percent Savings: The customer pays for energy produced by the system at a price per kilowatt hour tied to their exiting electricity rate. If their retail rate is, for example $0.10 and the savings guarantee is 25%, they would pay $0.075 per kilowatt hour. If their supplier rate increases, their PPA rate per kWh increases with it. But they always save 25%."]
[]
[]
[null,"Summary Financial Metrics"]
[null,null,null,"System Owner","PPA Customer"]
[null,"Key Performace Indicator"]
[null,"25-Year Costs:","$",{"$f":"AF52+AF58+AF62+AF69","v":-20508.91934117147},{"$f":"AF32","v":-18467.237731402704}]
[null,"25-Year Revenues:","$",{"$f":"AF55+AF59+AF76+AF84+AF90","v":29311.673731402705},{"$f":"AF26","v":23084.047164253374}]
[null,"25-Year Net Benefits:","$",{"$f":"D8+D9","v":8802.7543902312354},{"$f":"E8+E9","v":4616.8094328506704}]
[null,"25-Year Net Present Value (NPV):","$",{"$f":"E93+NPV('Detailed Inputs'!D20,F93:AD93)","v":3285.8899807009875},{"$f":"F93+NPV('Detailed Inputs'!D21,G93:AE93)","v":18193.758311650588}]
[null,"Return on Investment (ROI):","%",{"$f":"D10/(-D8)","v":0.42921590571375379},{"$f":"E10/(-E8)","v":0.24999999999999969}]
[null,"Internal Rate of Return (IRR)","$",{"$f":"IRR(E98:AD98)","v":5.8123218408134614E-2},"NA"]
[null,"Upfront Costs","$",{"$f":"E52","v":-17340},{"$f":"F52","v":0}]
[null,"Average Annual Revenue","$",{"$f":"AF93/25","v":352.11017560924927},{"$f":"AF36/25","v":184.67237731402699}]
[null,"Payback Period:","years",{"$f":"E95","v":11.983261656015701},{"$f":"E37","v":0}]
[]
[]
[null,"Business Case - PPA Customer"]
[]
[null,"Year",null,null,0,1,2,3,4,5,6,7,8,9,10,11,12,13,14,15,16,17,18,19,20,21,22,23,24,25]
[null,"REVENUES"]
[null,"Net Metering Revenue - Load 1","$","$ Annual",null,{"$f":"F232","v":770.90112075805678},782.38754745735184,794.0250707763156,805.81514000905486,817.75920198279323,829.85870037947734,842.11507503123585,854.52976118891297,867.10418876288429,879.83978153533928,892.73795634318708,905.80012223073493,919.02767957124706,932.42201915648786,945.98452125330937,959.71655462634112,973.61947552579318,987.6946266393727,1001.9433360072849,1016.3669158992577,1030.9666616525069,1045.7438504695265,1060.6997401745652,1075.8355679276178,1091.1525488947229,null,{"$f":"SUM(E23:AE23)","v":23084.047164253374}]
[null,"Net Metering Revenue - Load 2","$","$ Annual",null,{"$f":"F248","v":0},0,0,0,0,0,0,0,0,0,0,0,0,0,0,0,0,0,0,0,0,0,0,0,0,null,{"$f":"SUM(E24:AE24)","v":0},null,{"$f":"AF23+AF24","v":23084.047164253374}]
[null,"Demand Charge Savings","$ Manual","Estimated",null,0,0,0,0,0,0,0,0,0,0,0,0,0,0,0,0,0,0,0,0,0,0,0,0,0,null,{"$f":"SUM(E25:AE25)","v":0}]
[null,"Total Revenue",null,null,null,{"$f":"SUM(F23:F25)","v":770.90112075805678},782.38754745735184,794.0250707763156,805.81514000905486,817.75920198279323,829.85870037947734,842.11507503123585,854.52976118891297,867.10418876288429,879.83978153533928,892.73795634318708,905.80012223073493,919.02767957124706,932.42201915648786,945.98452125330937,959.71655462634112,973.61947552579318,987.6946266393727,1001.9433360072849,1016.3669158992577,1030.9666616525069,1045.7438504695265,1060.6997401745652,1075.8355679276178,1091.1525488947229,null,{"$f":"SUM(E26:AE26)","v":23084.047164253374}]
[]
[null,"Expenses"]
[null,"PPA Payment",{"$f":"'Detailed Inputs'!H7","v":"% Tied To Customer Rate"},"$ Annual",null,{"$f":"IF($C$29=\"Fixed Rate PPA\",-F197,-F213)","v":-616.72089660644542},-625.91003796588166,-635.22005662105255,-644.652112007244,-654.20736158623436,-663.88696030358187,-673.69206002498856,-683.6238089511304,-693.68335101030755,-703.87182522827118,-714.19036507454962,-724.64009778458785,-735.2221436569979,-745.93761532519034,-756.78761700264738,-767.77324370107294,-778.8955804206347,-790.15570131149809,-801.55466880582799,-813.09353271940643,-824.77332932200545,-836.59508037562091,-848.55979213965202,-860.66845434209426,-872.9220391157786,null,{"$f":"SUM(E29:AE29)","v":-18467.237731402704}]
[null,"Site Lease Payments","$","Fixed Annual",null,{"$f":"$E$51","v":0},0,0,0,0,0,0,0,0,0,0,0,0,0,0,0,0,0,0,0,0,0,0,0,0,null,{"$f":"SUM(E30:AE30)","v":0}]
[null,"Demand Charge Savings","$ Manual","Estimated",null,0,0,0,0,0,0,0,0,0,0,0,0,0,0,0,0,0,0,0,0,0,0,0,0,0,null,{"$f":"SUM(E31:AE31)","v":0}]
[null,"Total Revenue",null,null,null,{"$f":"SUM(F29:F31)","v":-616.72089660644542},-625.91003796588166,-635.22005662105255,-644.652112007244,-654.20736158623436,-663.88696030358187,-673.69206002498856,-683.6238089511304,-693.68335101030755,-703.87182522827118,-714.19036507454962,-724.64009778458785,-735.2221436569979,-745.93761532519034,-756.78761700264738,-767.77324370107294,-778.8955804206347,-790.15570131149809,-801.55466880582799,-813.09353271940643,-824.77332932200545,-836.59508037562091,-848.55979213965202,-860.66845434209426,-872.9220391157786,null,{"$f":"SUM(E32:AE32)","v":-18467.237731402704}]
[]
[null,"CASHFLOW"]
[null,"Net Benefits (Costs)","$",null,{"$f":"E26+E32","v":0},154.18022415161136,156.47750949147019,158.80501415526305,161.16302800181086,163.55184039655887,165.97174007589547,168.42301500624728,170.90595223778257,173.42083775257674,175.96795630706811,178.54759126863746,181.16002444614708,183.80553591424916,186.48440383129753,189.19690425066199,191.94331092526818,194.72389510515848,197.53892532787461,200.38866720145688,203.27338317985129,206.19333233050145,209.14877009390557,212.13994803491323,215.16711358552357,218.23050977894434,null,{"$f":"SUM(E35:AE35)","v":4616.809432850675}]
[null,"Cumulative Cashflow","$",null,{"$f":"E35","v":0},{"$f":"E36+F35","v":154.18022415161136},310.65773364308154,469.46274779834459,630.62577580015545,794.17761619671433,960.14935627260979,1128.5723712788572,1299.4783235166396,1472.8991612692164,1648.8671175762845,1827.414708844922,2008.5747332910692,2192.3802692053182,2378.8646730366158,2568.0615772872779,2760.0048882125461,2954.7287833177047,3152.2677086455792,3352.6563758470361,3555.9297590268875,3762.1230913573891,3971.2718614512946,4183.4118094862079,4398.578923071731,4616.809432850675,null,{"$f":"AD36","v":4616.809432850675}]
[null,"Payback Calculation",null,"Years",{"$f":"SUM(F37:AD37)","v":0},{"$f":"IF(F36<0,1,IF(AND(F36>0,E36<0),(-E36/(F36-E36)),0))","v":0},0,0,0,0,0,0,0,0,0,0,0,0,0,0,0,0,0,0,0,0,0,0,0,0,null,{"$f":"E37","v":0}]
[]
[null,"Business Case - System Owner"]
[]
{"$rows_left_out":214}